Index index by Group index by Distribution index by Vendor index by creation date index by Name Mirrors Help Search

java-1_8_0-openjdk-headless- RPM for armv7hl

From OpenSuSE 42.2 updates for armv7hl

Name: java-1_8_0-openjdk-headless Distribution: openSUSE Leap 42.2
Version: Vendor: openSUSE
Release: 3.1 Build date: Thu Nov 24 18:49:37 2016
Group: Development/Languages/Java Build host: armbuild14
Size: 56102759 Source RPM: java-1_8_0-openjdk-
Summary: OpenJDK 8 Runtime Environment
The OpenJDK 8 runtime environment without audio and video support.




Apache-1.1 and Apache-2.0 and GPL-1.0+ and GPL-2.0 and GPL-2.0-with-classpath-exception and LGPL-2.0 and MPL-1.0 and MPL-1.1 and SUSE-Public-Domain and W3C


* Wed Nov 09 2016
  - Upgrade to version jdk8u111 (icedtea 3.2.0)
    * Security fixes
      + S8146490: Direct indirect CRL checks
      + S8151921: Improved page resolution
      + S8155968: Update command line options
      + S8155973, CVE-2016-5542: Tighten jar checks (bsc#1005522)
      + S8156794: Extend data sharing
      + S8157176: Improved classfile parsing
      + S8157739, CVE-2016-5554: Classloader Consistency Checking
      + S8157749: Improve handling of DNS error replies
      + S8157753: Audio replay enhancement
      + S8157759: LCMS Transform Sampling Enhancement
      + S8157764: Better handling of interpolation plugins
      + S8158302: Handle contextual glyph substitutions
      + S8158993, CVE-2016-5568: Service Menu services (bsc#1005525)
      + S8159495: Fix index offsets
      + S8159503: Amend Annotation Actions
      + S8159511: Stack map validation
      + S8159515: Improve indy validation
      + S8159519, CVE-2016-5573: Reformat JDWP messages (bsc#1005526)
      + S8160090: Better signature handling in pack200
      + S8160094: Improve pack200 layout
      + S8160098: Clean up color profiles
      + S8160591, CVE-2016-5582: Improve internal array handling
      + S8160838, CVE-2016-5597: Better HTTP service (bsc#1005528)
      + PR3206, RH1367357: lcms2: Out-of-bounds read in
      + CVE-2016-5556 (bsc#1005524)
    * New features
      + PR1370: Provide option to build without debugging
      + PR1375: Provide option to strip and link debugging info after
      + PR1537: Handle alternative Kerberos credential cache
      + PR1978: Allow use of system PCSC
      + PR2445: Support system libsctp
      + PR3182: Support building without pre-compiled headers
      + PR3183: Support Fedora/RHEL system crypto policy
      + PR3221: Use pkgconfig to detect Kerberos CFLAGS and libraries
    * Import of OpenJDK 8 u102 build 14
      + S4515292: ReferenceType.isStatic() returns true for arrays
      + S4858370: JDWP: Memory Leak: GlobalRefs never deleted when
      processing invokeMethod command
      + S6976636: JVM/TI test ex03t001 fails assertion
      + S7185591: ERROR: could not find app's Java
      + S8017462: G1: guarantee fails with
      + S8034168: ThreadMXBean/ failed, blocked on wrong
      + S8036006: [TESTBUG] sun/tools/native2ascii/
      fails: Process exit code was 0, but error was expected.
      + S8041781: Need new regression tests for PBE keys
      + S8041787: Need new regressions tests for buffer handling for
      PBE algorithms
      + S8043836: Need new tests for AES cipher
      + S8044199: Tests for RSA keys and key specifications
      + S8044772: still times out with -Xcomp
      + S8046339: sun.rmi.transport.DGCAckHandler leaks memory
      + S8047031: Add SocketPermission tests for legacy socket types
      + S8048052: Permission tests for setFactory
      + S8048138: Tests for JAAS callbacks
      + S8048147: Privilege tests with JAAS Subject.doAs
      + S8048356: SecureRandom default provider tests
      + S8048357: PKCS basic tests
      + S8048360: Test signed jar files
      + S8048362: Tests for doPrivileged with accomplice
      + S8048596: Tests for AEAD ciphers
      + S8048599: Tests for key wrap and unwrap operations
      + S8048603: Additional tests for MAC algorithms
      + S8048604: Tests for strong crypto ciphers
      + S8048607: Test key generation of DES and DESEDE
      + S8048610: Implement regression test for bug fix of 4686632
      in JCE
      + S8048617: Tests for PKCS12 read operations
      + S8048618: Tests for PKCS12 write operations.
      + S8048619: Implement tests for converting PKCS12 keystores
      + S8048624: Tests for SealedObject
      + S8048819: Implement reliability test for DH algorithm
      + S8048820: Implement tests for SecretKeyFactory
      + S8048830: Implement tests for new functionality provided in
      JEP 166
      + S8049237: Need new tests for X509V3 certificates
      + S8049321: Support SHA256WithDSA in JSSE
      + S8049429: Tests for java client server communications with
      various TLS/SSL combinations.
      + S8049432: New tests for TLS property jdk.tls.client.protocols
      + S8049814: Additional SASL client-server tests
      + S8050281: New permission tests for JEP 140
      + S8050370: Need new regressions tests for messageDigest with
      + S8050371: More MessageDigest tests
      + S8050374: More Signature tests
      + S8050427: LoginContext tests to cover JDK-4703361
      + S8050460: JAAS login/logout tests with LoginContext
      + S8050461: Tests for syntax checking of JAAS configuration
      + S8054278: Refactor jps utility tests
      + S8055530: assert(_exits.control()->is_top() ||
      !_gvn.type(ret_phi)->empty()) failed: return value must be
      well defined
      + S8055844: [TESTBUG]
      fails on Solaris Sparc due to incorrect page size being used
      + S8059677: Thread.getName() instantiates Strings
      + S8061464: A typo in CipherTestUtils test
      + S8062536: [TESTBUG] Conflicting GC combinations in jdk tests
      + S8065076: java/net/SocketPermission/
      fails intermittently
      + S8065078: NetworkInterface.getNetworkInterfaces() triggers
      intermittent test failures
      + S8066871: java.lang.VerifyError: Bad local variable type -
      local final String
      + S8068427: Hashtable deserialization reconstitutes table with
      wrong capacity
      + S8069038: javax/net/ssl/TLS/ needs
      to be updated for JDK-8061210
      + S8069253: javax/net/ssl/TLS/ failed on Mac
      + S8071125: Improve exception messages in URLPermission
      + S8072081: Supplementary characters are rejected in comments
      + S8072463: Remove requirement that AKID and SKID have to match
      when building certificate chain
      + S8072725: Provide more granular levels for GC verification
      + S8073400: Some Monospaced logical fonts have a different
      + S8073872: Schemagen fails with StackOverflowError if element
      references containing class
      + S8074931: Additional tests for CertPath API
      + S8075286: Additional tests for signature algorithm OIDs and
      transformation string
      + S8076486: [TESTBUG]
      javax/security/auth/Subject/doAs/ fails if
      extra VM options are given
      + S8076545: Text size is twice bigger under Windows L&F on Win
      8.1 with HiDPI display
      + S8076995: gc/ergonomics/
      failed with java.lang.RuntimeException: 'new_active_workers'
      missing from stdout/stderr
      + S8079138: Additional negative tests for XML signature
      + S8081512: Remove sun.invoke.anon classes, or move / co-locate
      them with tests
      + S8081771: ProcessTool.createJavaProcessBuilder() needs new
      addTestVmAndJavaOptions argument
      + S8129419: heapDumper.cpp: assert(length_in_bytes > 0) failed:
      nothing to copy
      + S8130150: Implement BigInteger.montgomeryMultiply intrinsic
      + S8130242: DataFlavorComparator transitivity exception
      + S8130304: Inference: NodeNotFoundException thrown with deep
      generic method call chain
      + S8130425: libjvm crash due to stack overflow in executables
      with 32k tbss/tdata
      + S8133023: ParallelGCThreads is not calculated correctly
      + S8134111: Unmarshaller unmarshalls XML element which doesn't
      have the expected namespace
      + S8135259: InetAddress.getAllByName only reports "unknown
      error" instead of actual cause
      + S8136506: Include as a property that can
      be queried by jtreg
      + S8137068: Tests added in JDK-8048604 fail to compile
      + S8139040: Fix initializations before ShouldNotReachHere()
      etc. and enable -Wuninitialized on linux.
      + S8139581: AWT components are not drawn after removal and
      addition to a container
      + S8141243: Unexpected timezone returned after parsing a date
      + S8141420: Compiler runtime entries don't hold Klass* from
      being GCed
      + S8141445: Use of Solaris/SPARC M7 can
      generate unknown signal in hs_err file
      + S8141551: C2 can not handle returns with inccompatible
      interface arrays
      + S8143377: Test fails
      + S8143647: Javac compiles method reference that allows results
      in an IllegalAccessError
      + S8144144: ORB destroy() leaks filedescriptors after
      unsuccessful connection
      + S8144593: Suppress not recognized property/feature warning
      messages from SAXParser
      + S8144957: Remove PICL warning message
      + S8145039: JAXB marshaller fails with ClassCastException on
      classes generated by xjc
      + S8145228: Java Access Bridge,
      getAccessibleStatesStringFromContext doesn't wrap the call to
      + S8145388: URLConnection.guessContentTypeFromStream returns
      image/jpg for some JPEG images
      + S8145974: XMLStreamWriter produces invalid XML for surrogate
      pairs on OutputStreamWriter
      + S8146035: Windows - With LCD antialiasing, some glyphs are
      not rendered correctly
      + S8146192: Add test for JDK-8049321
      + S8146274: Thread spinning on WeakHashMap.getEntry() with
      concurrent use of nashorn
      + S8147468: Allow users to bound the size of buffers cached in
      the per-thread buffer caches
      + S8147645: get_ctrl_no_update() code is wrong
      + S8147807: crash in on linux-sparc
      + S8148379: jdk.nashorn.api.scripting spec. adjustments,
      + S8148627: to 64-bit
      + S8148820: Missing @since Javadoc tag in Logger.log(Level,
      + S8148926: Call site profiling fails on braces-wrapped
      anonymous function
      + S8149017: Delayed provider selection broken in RSA client key
      + S8149029: Secure validation of XML based digital signature
      always enabled when checking wrapping attacks
      + S8149330: Capacity of StringBuilder should not get close to
      Integer.MAX_VALUE unless necessary
      + S8149334: JSON.parse(JSON.stringify([])).push(10) creates an
      array containing two elements
      + S8149368: [hidpi] JLabel font is twice bigger than JTextArea
      font on Windows 7,HiDPI, Windows L&F
      + S8149411: PKCS12KeyStore cannot extract AES Secret Keys
      + S8149417: Use final restricted flag
      + S8149450: LdapCtx.processReturnCode() throwing Null Pointer
      + S8149453: [hidpi] JFileChooser does not scale properly on
      Windows with HiDPI display and Windows L&F
      + S8149543: range check CastII nodes should not be split
      through Phi
      + S8149743: JVM crash after debugger hotswap with lambdas
      + S8149744: fix testng.jar delivery in Nashorn build.xml
      + S8149915: enabling validate-annotations feature for xsd
      schema with annotation causes NPE
      + S8150002: Check for the validity of oop before printing it in
      + S8150470: JCK: api/xsl/conf/copy/copy19 test failure
      + S8150518: G1 GC crashes at
      + S8150533: Test
      java/util/logging/ times out
      + S8150704: XALAN: ERROR: 'No more DTM IDs are available' when
      transforming with lots of temporary result trees
      + S8150780: Repeated offer and remove on ConcurrentLinkedQueue
      lead to an OutOfMemoryError
      + S8151064: com/sun/jdi/ fails
      + S8151197: [TEST_BUG] Need to backport fix for
      + S8151352: jdk/test/sample fails with "effective library path
      is outside the test suite"
      + S8151431: DateFormatSymbols triggers this.clone() in the
      + S8151535: TESTBUG: java/lang/invoke/
      should be modified to run with JTREG 4.1 b13
      + S8151731: Add new jtreg keywords to jdk 8
      + S8151998: VS2010 ThemeReader.cpp(758) : error C3861: 'round':
      identifier not found
      + S8152927: Incorrect GPL header in
      + S8153252: SA: Hotspot build on Windows fails if make/closed
      folder does not exist
      + S8153531: Improve exception messaging for RSAClientKeyExchange
      + S8153641: assert(thread_state == _thread_in_native) failed:
      Assumed thread_in_native while heap dump
      + S8153673: [BACKOUT] JDWP: Memory Leak: GlobalRefs never
      deleted when processing invokeMethod command
      + S8154304: NullpointerException at
      + S8154722: Test gc/ergonomics/
      + S8157078: 8u102 L10n resource file updates
      + S8157838: Personalized Windows Font Size is not taken into
      account in Java8u102
    * Import of OpenJDK 8 u111 build 14
      + S6882559: new JEditorPane("text/plain","") fails for null
      context class loader
      + S8049171: Additional tests for jarsigner's warnings
      + S8063086: Math.pow yields different results upon repeated
      + S8140530: Creating a VolatileImage with size 0,0 results in
      no longer working g2d.drawString
      + S8142926: OutputAnalyzer's shouldXXX() calls return this
      + S8147077: IllegalArgumentException thrown by
      + S8148127: IllegalArgumentException thrown by JCK test
      in opengl pipeline
      + S8150611: Security problem on sun.misc.resources.Messages*
      + S8153399: Constrain AppCDS behavior (back port)
      + S8157653: [Parfait] Uninitialised variable in awt_Font.cpp
      + S8158734: JEditorPane.createEditorKitForContentType throws
      NPE after 6882559
      + S8158994: Service Menu services
      + S8159684: (tz) Support tzdata2016f
      + S8160904: Typo in code from 8079718 fix :
      + S8160934: isnan() is not available on older MSVC compilers
      + S8161141: correct bugId for JDK-8158994 fix push
      + S8162411: Service Menu services 2
      + S8162419: closed/com/oracle/jfr/runtime/
      failing after JDK-8155968
      + S8162511: 8u111 L10n resource file updates
      + S8162792: Remove constraint DSA keySize < 1024 from
      jdk.jar.disabledAlgorithms in jdk8
      + S8164452: 8u111 L10n resource file update - msgdrop 20
      + S8165816: jarsigner -verify shows jar unsigned if it was
      signed with a weak algorithm
      + S8166381: Back out changes to the file to not
      disable MD5
    * Backports
      + S8078628, PR3208: Zero build fails with pre-compiled headers
      + S8141491, PR3159, G592292: Unaligned memory access in Bits.c
      + S8157306, PR3121: Random infrequent null pointer exceptions
      in javac (enabled on AArch64 only)
      + S8162384, PR3122: Performance regression: bimorphic inlining
      may be bypassed by type speculation
    * Bug fixes
      + PR3123: Some object files built without -fPIC on x86 only
      + PR3126: pax-mark-vm script calls "exit -1" which is invalid
      in dash
      + PR3127, G590348: Only apply PaX markings by default on
      running PaX kernels
      + PR3199: Invalid nashorn URL
      + PR3201: Update infinality configure test
      + PR3218: PR3159 leads to build failure on clean tree
    * AArch64 port
      + S8131779, PR3220: AARCH64: add Montgomery multiply intrinsic
      + S8167200, PR3220: AArch64: Broken stack pointer adjustment in
      + S8167421, PR3220: AArch64: in one core system, fatal error:
      Illegal threadstate encountered
      + S8167595, PR3220: AArch64: SEGV in stub code
      + S8168888, PR3220: Port 8160591: Improve internal array
      handling to AArch64.
    * Shenandoah
      + PR3224: Shenandoah broken when building without pre-compiled
  - Modified patch:
    * java-1_8_0-openjdk-gcc6.patch
      + rediff to a changed context
  - Build against system kerberos for openSUSE 13.1 and greater and
  - Build against system pcsc and sctp for openSUSE 13.2 and greater
    and SLE12
* Wed Sep 21 2016
  - Added patch:
    * s390-java-opts.patch
    - Solve memory issues when building s390 version
* Tue Jul 26 2016
  - Upgrade to version jdk8u101 (icedtea 3.1.0)
  - New in release 3.1.0 (2016-07-25):
    * Security fixes
    - S8079718, CVE-2016-3458: IIOP Input Stream Hooking
    - S8145446, CVE-2016-3485: Perfect pipe placement (Windows
      only) (bsc#989734)
    - S8146514: Enforce GCM limits
    - S8147771: Construction of static protection domains under
      Javax custom policy
    - S8148872, CVE-2016-3500: Complete name checking (bsc#989730)
    - S8149070: Enforce update ordering
    - S8149962, CVE-2016-3508: Better delineation of XML processing
    - S8150752: Share Class Data
    - S8151925: Font reference improvements
    - S8152479, CVE-2016-3550: Coded byte streams (bsc#989733)
    - S8153312: Constrain AppCDS behavior
    - S8154475, CVE-2016-3587: Clean up lookup visibility
    - S8155981, CVE-2016-3606: Bolster bytecode verification
    - S8155985, CVE-2016-3598: Persistent Parameter Processing
    - S8158571, CVE-2016-3610: Additional method handle validation
    - CVE-2016-3552 (bsc#989726)
    - CVE-2016-3511 (bsc#989727)
    - CVE-2016-3503 (bsc#989728)
    - CVE-2016-3498 (bsc#989729)
    * New features
    - S8145547, PR1061: [AWT/Swing] Conditional support for GTK 3
      on Linux
    - PR2821: Support building OpenJDK with --disable-headful
    - PR2931, G478960: Provide Infinality Support via fontconfig
    - PR3079: Provide option to build Shenandoah on x86_64
    * Import of OpenJDK 8 u92 build 14
    - S6869327: Add new C2 flag to keep safepoints in counted
    - S8022865: [TESTBUG] Compressed Oops testing needs to be
    - S8029630: Thread id should be displayed as a hex number in
      error report
    - S8029726: On OS X some dtrace probe names are mismatched with
    - S8029727: On OS X dtrace probes
      Call<type>MethodA/Call<type>MethodV are not fired.
    - S8029728: On OS X dtrace probes SetStaticBooleanField are not
    - S8038184: XMLSignature throws StringIndexOutOfBoundsException
      if ID attribute value is empty String
    - S8038349: Signing XML with DSA throws Exception when key is
      larger than 1024 bits
    - S8041501: ImageIO reader is not capable of reading JPEGs
      without JFIF header
    - S8041900: [macosx] Java forces the use of discrete GPU
    - S8044363: Remove special build options for unpack200 executable
    - S8046471: Use OPENJDK_TARGET_CPU_ARCH instead of legacy value
      for hotspot ARCH
    - S8046611: Build errors with gcc on sparc/fastdebug
    - S8047763: Recognize sparc64 as a sparc platform
    - S8048232: Fix for 8046471 breaks PPC64 build
    - S8052396: Catch exceptions resulting from missing font cmap
    - S8058563: InstanceKlass::_dependencies list isn't cleared from
      empty nmethodBucket entries
    - S8061624: [TESTBUG] Some tests cannot be ran under compact
      profiles and therefore shall be excluded
    - S8062901: Iterators is spelled incorrectly in the Javadoc for
    - S8064330: Remove SHA224 from the default support list if
      SunMSCAPI enabled
    - S8065579: WB method to start G1 concurrent mark cycle should
      be introduced
    - S8065986: Compiler fails to NullPointerException when calling
      super with Object<>()
    - S8066974: Compiler doesn't infer method's generic type
      information in lambda body
    - S8067800: Clarify java.time.chrono.Chronology.isLeapYear for
      out of range years
    - S8068033: JNI exception pending in jdk/src/share/bin/java.c
    - S8068042: Check jdk/src/share/native/sun/misc/URLClassPath.c
      for JNI pending
    - S8068162: jvmtiRedefineClasses.cpp: guarantee(false) failed:
      OLD and/or OBSOLETE method(s) found
    - S8068254: Method reference uses wrong qualifying type
    - S8074696: Remote debugging session hangs for several minutes
      when calling findBootType
    - S8074935: jdk8 keytool doesn't validate pem files for RFC 1421
      correctness, as jdk7 did
    - S8078423: [TESTBUG] javax/print/PrintSEUmlauts/
      relies on system locale
    - S8080492: [Parfait] Uninitialised variable in
    - S8080650: Enable stubs to use frame pointers correctly
    - S8122944: perfdata used is seen as too high on sparc zone with
      jdk1.9 and causes a test failure
    - S8129348: Debugger hangs in trace mode with TRACE_SENDS
    - S8129847: Compiling methods generated by Nashorn triggers high
      memory usage in C2
    - S8130506: javac AssertionError when invoking
      MethodHandle.invoke with lambda parameter
    - S8130910: hsperfdata file is created in wrong directory and
      not cleaned up if /tmp/hsperfdata_<username> has wrong permissions
    - S8131129: Attempt to define a duplicate BMH$Species class
    - S8131665: Bad exception message in HandshakeHash.getFinishedHash
    - S8131782: C1 Class.cast optimization breaks when Class is
      loaded from static final
    - S8132503: [macosx] Chinese full stop symbol cannot be entered
      with Pinyin IM on OS X
    - S8133207: test fails after changes for
    - S8133924: NPE may be thrown when xsltc select a non-existing
      node after JDK-8062518
    - S8134007: Improve string folding
    - S8134759: jdb: Incorrect stepping inside finally block
    - S8134963: [Newtest] New stress test for changing the coarseness
      level of G1 remembered set
    - S8136442: Don't tie Certificate signature algorithms to
    - S8137106: EUDC (End User Defined Characters) are not displayed
      on Windows with Java 8u60+
    - S8138745: Implement ExitOnOutOfMemory and CrashOnOutOfMemory
      in HotSpot
    - S8138764: In some cases the usage of TreeLock can be replaced
      by other synchronization
    - S8139373: [TEST_BUG] java/net/MulticastSocket/
      failed with timeout
    - S8139424: SIGSEGV, Problematic frame: # V []
      void InstanceKlass::oop_oop_iterate_oop_maps_specialized<true,oopDesc*,MarkAndPushClosure>
    - S8139436: might load incomplete
    - S8139751: Javac crash with -XDallowStringFolding=false
    - S8139863: [TESTBUG] Need to port tests for JDK-8134903 to
    - S8139985: JNI exception pending in
    - S8140031: SA: Searching for a value in Threads does not work
    - S8140249: JVM Crashing During startUp If Flight Recording is
    - S8140344: add support for 3 digit update release numbers
    - S8140587: Atomic*FieldUpdaters should use Class.isInstance
      instead of direct class check
    - S8141260: isReachable crash in windows xp
    - S8143297: Nashorn compilation time reported in nanoseconds
    - S8143397: It looks like InetAddress.isReachable(timeout) works
    - S8143855: Bad printf formatting in frame_zero.cpp
    - S8143896: java.lang.Long is implicitly converted to double
    - S8143963: improve ClassLoader::trace_class_path to accept an
      additional outputStream* arg
    - S8144020: Remove long as an internal numeric type
    - S8144131: ArrayData.getInt implementations do not convert to
    - S8144483: One long Safepoint pause directly after each GC log
    - S8144487: PhaseIdealLoop::build_and_optimize() must restore
      major_progress flag if skip_loop_opts is true
    - S8144885: agent/src/os/linux/libproc.h needs to support
      Linux/SPARC builds
    - S8144935: C2: safepoint is pruned from a non-counted loop
    - S8144937: [TEST_BUG] testlibrary_tests should be excluded for
      compact1 and compact2 execution
    - S8145017: Add support for 3 digit hotspot minor version numbers
    - S8145099: Better error message when SA can't attach to a process
    - S8145442: Add the facility to verify remembered sets for G1
    - S8145466: javac: No line numbers in compilation error
    - S8145539: (coll) AbstractMap.keySet and .values should not be
    - S8145550: Megamorphic invoke should use CompiledFunction
      variants without any LinkLogic
    - S8145669: apply2call optimized callsite fails after becoming
    - S8145722: NullPointerException in javadoc
    - S8145754: PhaseIdealLoop::is_scaled_iv_plus_offset() does not
      match AddI
    - S8146147: Java linker indexed property getter does not work
      for computed nashorn string
    - S8146566: OpenJDK build can't handle commas in LDFLAGS
    - S8146725: Issues with SignatureAndHashAlgorithm.getSupportedAlgorithms
    - S8146979: Backport of 8046471 breaks ppc64 build in jdk8u
      because 8072383 was badly backported before
    - S8147087: Race when reusing PerRegionTable bitmaps may result
      in dropped remembered set entries
    - S8147630: Wrong test result pushed to 8u-dev
    - S8147845: Varargs Array functions still leaking longs
    - S8147857: RMIConnector logs attribute names incorrectly
    - S8148353: [linux-sparc] Crash in on Linux SPARC
    - S8150791: 8u76 L10n resource file translation update
    * Import of OpenJDK 8 u101 build 13
    - S6483657: MSCAPI provider does not create unique alias names
    - S6675699: need comprehensive fix for unconstrained ConvI2L
      with narrowed type
    - S8037557: test timeout
    - S8038837: Add support to jarsigner for specifying timestamp
      hash algorithm
    - S8081778: Use Intel x64 CPU instructions for RSA acceleration
    - S8130150: Implement BigInteger.montgomeryMultiply intrinsic
    - S8130735: javax.swing.TimerQueue: timer fires late when
      another timer starts
    - S8143913: MSCAPI keystore should accept Certificate[] in
    - S8144313: Test SessionTimeOutTests can be timeout
    - S8146240: Three nashorn files contain "GNU General Public
      License" header
    - S8146387: Test SSLSession/SessionCacheSizeTests socket accept
      timed out
    - S8146669: Test SessionTimeOutTests fails intermittently
    - S8146993: Several javax/management/remote/mandatory regression
      tests fail after JDK-8138811
    - S8147994: [macosx] JScrollPane jitters up/down during trackpad
      scrolling on MacOS/Aqua
    - S8151522: Disable 8130150 and 8081778 intrinsics by default
    - S8151876: (tz) Support tzdata2016d
    - S8152098: Fix 8151522 caused test
      compiler/intrinsics/squaretolen/ to fail
    - S8157077: 8u101 L10n resource file updates
    * Backports
    - S6260348, PR3066: GTK+ L&F JTextComponent not respecting
      desktop caret blink rate
    - S6778087, PR1061: getLocationOnScreen() always returns (0, 0)
      for mouse wheel events
    - S6961123, PR2972: setWMClass fails to null-terminate WM_CLASS
    - S8008657, PR3077: JSpinner setComponentOrientation doesn't
      affect on text orientation
    - S8014212, PR2866: Robot captures black screen
    - S8029339, PR1061: Custom MultiResolution image support on
      HiDPI displays
    - S8031145, PR3077: Re-examine closed i18n tests to see it they
      can be moved to the jdk repository.
    - S8034856, PR3095: gcc warnings compiling
    - S8034857, PR3095: gcc warnings compiling
    - S8035054, PR3095: JarFacade.c should not include ctype.h
    - S8035287, PR3095: gcc warnings compiling various libraries
    - S8038631, PR3077: Create wrapper for awt.Robot with additional
    - S8039279, PR3077: Move awt tests to openjdk repository
    - S8041561, PR3077: Inconsistent opacity behaviour between
      JCheckBox and JRadioButton
    - S8041592, PR3077: [TEST_BUG] Move 42 AWT hw/lw mixing tests
      to jdk
    - S8041915, PR3077: Move 8 awt tests to OpenJDK regression
      tests tree
    - S8043126, PR3077: move awt automated functional tests from
      AWT_Events/Lw and AWT_Events/AWT to OpenJDK repository
    - S8043131, PR3077: Move ShapedAndTranslucentWindows and GC
      functional AWT tests to regression tree
    - S8044157, PR3077: [TEST_BUG] Improve recently submitted
      AWT_Mixing tests
    - S8044172, PR3077: [TEST_BUG] Move regtests for 4523758 and
      AltPlusNumberKeyCombinationsTest to jdk
    - S8044429, PR3077: move awt automated tests for AWT_Modality
      to OpenJDK repository
    - S8044762, PR2960: com/sun/jdi/ test time out
    - S8044765, PR3077: Move functional tests
      AWT_SystemTray/Automated to openjdk repository
    - S8047180, PR3077: Move functional tests AWT_Headless/Automated
      to OpenJDK repository
    - S8047367, PR3077: move awt automated tests from AWT_Modality
      to OpenJDK repository - part 2
    - S8048246, PR3077: Move AWT_DnD/Clipboard/Automated functional
      tests to OpenJDK
    - S8049226, PR2960: com/sun/jdi/ test times out
    - S8049617, PR3077: move awt automated tests from AWT_Modality
      to OpenJDK repository - part 3
    - S8049694, PR3077: Migrate functional
      AWT_DesktopProperties/Automated tests to OpenJDK
    - S8050885, PR3077: move awt automated tests from AWT_Modality
      to OpenJDK repository - part 4
    - S8051440, PR3077: move tests about maximizing undecorated to
    - S8052012, PR3077: move awt automated tests from AWT_Modality
      to OpenJDK repository - part 5
    - S8052408, PR3077: Move AWT_BAT functional tests to OpenJDK (3
      of 3)
    - S8053657, PR3077: [TEST_BUG] move some 5 tests related to
      undecorated Frame/JFrame to JDK
    - S8054143, PR3077: move awt automated tests from AWT_Modality
      to OpenJDK repository - part 6
    - S8054358, PR3077: move awt automated tests from AWT_Modality
      to OpenJDK repository - part 7
    - S8054359, PR3077: move awt automated tests from AWT_Modality
      to OpenJDK repository - part 8
    - S8055360, PR3077: Move the rest part of AWT
      ShapedAndTranslucent tests to OpenJDK
    - S8055664, PR3077: move 14 tests about setLocationRelativeTo
      to jdk
    - S8055836, PR3077: move awt tests from AWT_Modality to OpenJDK
      repository - part 9
    - S8056911, PR3077: Remove internal API usage from ExtendedRobot
    - S8057694, PR3077: move awt tests from AWT_Modality to OpenJDK
      repository - part 10
    - S8058959, PR1061: closed/java/awt/event/ComponentEvent/MovedResizedTwiceTest/
      failed automatically
    - S8062606, PR3077: Fix a typo in java.awt.Robot class
    - S8063102, PR3077: Change open awt regression tests to avoid
      sun.awt.SunToolkit.realSync, part 1
    - S8063104, PR3077: Change open awt regression tests to avoid
      sun.awt.SunToolkit.realSync, part 2
    - S8063106, PR3077: Change open swing regression tests to avoid
      sun.awt.SunToolkit.realSync, part 1
    - S8063107, PR3077: Change open swing regression tests to avoid
      sun.awt.SunToolkit.realSync, part 2
    - S8064573, PR3077: [TEST_BUG] javax/swing/text/AbstractDocument/6968363/
      is asocial pressing VK_LEFT and not releasing
    - S8064575, PR3077: [TEST_BUG] javax/swing/JEditorPane/6917744/
      100 times press keys and never releases
    - S8064809, PR3077: [TEST_BUG] javax/swing/JComboBox/4199622/
      contains a lot of keyPress and not a single keyRelease
    - S8067441, PR3077: Some tests fails with error: cannot find symbol
    - S8068228, PR3077: Test closed/java/awt/Mouse/MaximizedFrameTest/MaximizedFrameTest
      fails with GTKLookAndFeel
    - S8069361, PR1061: SunGraphics2D.getDefaultTransform() does not
      include scale factor
    - S8073320, PR1061: Windows HiDPI Graphics support
    - S8074807, PR3077: Fix some tests unnecessary using internal API
    - S8076315, PR3077: move 4 manual functional swing tests to
      regression suite
    - S8078504, PR3094: Zero lacks declaration of
    - S8129822, PR3077: Define "headful" jtreg keyword
    - S8132123, PR1061: MultiResolutionCachedImage unnecessarily
      creates base image to get its size
    - S8133539, PR1061: [TEST_BUG] Split
      java/awt/image/ in two to allow
      restricted access
    - S8137571, PR1061: Linux HiDPI Graphics support
    - S8142406, PR1061: [TEST] MultiResolution image: need test to
      cover the case when @2x image is corrupted
    - S8145188, PR2945: No LocalVariableTable generated for the
      entire JDK
    - S8150258, PR1061: [TEST] HiDPI: create a test for
      multiresolution menu items icons
    - S8150724, PR1061: [TEST] HiDPI: create a test for
      multiresolution icons
    - S8150844, PR1061: [hidpi] [macosx] -Dsun.java2d.uiScale should
      be taken into account for OS X
    - S8151841, PR2882: Build needs additional flags to compile with
      GCC 6 [plus parts of 8149647 & 8032045]
    - S8155613, PR1061: [PIT] crash in
    - S8156020, PR1061: 8145547 breaks AIX and and uses RTLD_NOLOAD
    - S8156128, PR1061: Tests for [AWT/Swing] Conditional support
      for GTK 3 on Linux
    - S8158260, PR2991, RH1341258: PPC64: unaligned Unsafe.getInt can
      lead to the generation of illegal instructions (bsc#988651)
    - S8159244, PR3074: Partially initialized string object created
      by C2's string concat optimization may escape
    - S8159690, PR3077: [TESTBUG] Mark headful tests with @key
    - S8160294, PR2882, PR3095: Some client libraries cannot be
      built with GCC 6
    * Bug fixes
    - PR1958: GTKLookAndFeel does not honor
    - PR2822: Feed LIBS & CFLAGS into configure rather than make to
      avoid re-discovery by OpenJDK configure
    - PR2932: Support ccache in a non-automagic manner
    - PR2933: Support ccache 3.2 and later
    - PR2964: Set system defaults based on OS
    - PR2974, RH1337583: PKCS#10 certificate requests now use CRLF
      line endings rather than system line endings
    - PR3078: Remove duplicated line dating back to 6788347 and
    - PR3083, RH1346460: Regression in SSL debug output without an
      ECC provider
    - PR3089: Remove old memory limits patch
    - PR3090, RH1204159: SystemTap is heavily confused by multiple
    - PR3095: Fix warnings in URLClassPath.c
    - PR3096: Remove dead --disable-optimizations option
    - PR3105: Use version from to create tarball filename
    - PR3106: Handle both correctly-spelt property
      "enableCustomValueHandler" introduced by S8079718 and typo
    - PR3108: Shenandoah patches not included in release tarball
    - PR3110: Update documentation in INSTALL
    * AArch64 port
    - S8145320, PR3078: Create unsafe_arraycopy and
      generic_arraycopy for AArch64
    - S8148328, PR3078: aarch64: redundant lsr instructions in stub
    - S8148783, PR3078: aarch64: SEGV running SpecJBB2013
    - S8148948, PR3078: aarch64: generate_copy_longs calls align()
    - S8149080, PR3078: AArch64: Recognise disjoint array copy in
      stub code
    - S8149365, PR3078: aarch64: memory copy does not prefetch on
      backwards copy
    - S8149907, PR3078: aarch64: use load/store pair instructions
      in call_stub
    - S8150038, PR3078: aarch64: make use of CBZ and CBNZ when
      comparing narrow pointer with zero
    - S8150045, PR3078: arraycopy causes segfaults in SATB during
      garbage collection
    - S8150082, PR3078: aarch64: optimise small array copy
    - S8150229, PR3078: aarch64: pipeline class for several
      instructions is not set correctly
    - S8150313, PR3078: aarch64: optimise array copy using SIMD
    - S8150394, PR3078: aarch64: add support for 8.1 LSE CAS
    - S8151340, PR3078: aarch64: prefetch the destination word for
      write prior to ldxr/stxr loops.
    - S8151502, PR3078: optimize pd_disjoint_words and
    - S8151775, PR3078: aarch64: add support for 8.1 LSE atomic
    - S8152537, PR3078: aarch64: Make use of CBZ and CBNZ when
      comparing unsigned values with zero.
    - S8152840, PR3078: aarch64: improve _unsafe_arraycopy stub
    - S8153713, PR3078: aarch64: improve short array clearing using
      store pair
    - S8153797, PR3078: aarch64: Add Arrays.fill stub code
    - S8154537, PR3078: AArch64: some integer rotate instructions
      are never emitted
    - S8154739, PR3078: AArch64: TemplateTable::fast_xaccess loads
      in wrong mode
    - S8155015, PR3078: Aarch64: bad assert in spill generation
    - S8155100, PR3078: AArch64: Relax alignment requirement for
    - S8155612, PR3078: Aarch64: vector nodes need to support
      misaligned offset
    - S8155617, PR3078: aarch64: ClearArray does not use DC ZVA
    - S8155653, PR3078: not pushed
      with 8155612
    - S8156731, PR3078: aarch64: java/util/Arrays/ fails
      due to _generic_arraycopy stub routine
    - S8157841, PR3078: aarch64: prefetch ignores cache line size
    - S8157906, PR3078: aarch64: some more integer rotate
      instructions are never emitted
    - S8158913, PR3078: aarch64: SEGV running Spark terasort
    - S8159052, PR3078: aarch64: optimise unaligned copies in
      pd_disjoint_words and pd_conjoint_words
    - S8159063, PR3078: aarch64: optimise unaligned array copy long
    - PR3078: Cleanup remaining differences from aarch64/jdk8u tree
  - Removed patches:
    * compare-pointer-with-literal.patch
    * implicit-pointer-decl.patch
    * hotspot-aarch64-fix-48bit-va.patch
    - Fixed differently upsteam
  - Modified patch:
    * java-1_8_0-openjdk-gcc6.patch
    - Rediff to new context
  - Remove hacks to make build on ix86, since it seems they are not
    needed anymore
  - Remove special flags for gcc6, since they are handled upstream
* Thu Jul 07 2016
  - Fix script linking /usr/share/javazi/tzdb.dat for platform where
    it applies (bsc#987895)
  - Enable SunEC for SLE12 and Leap
* Tue Jun 14 2016
  - Fix aarch64 running with 48 bits va space (bsc#984684)
    * hotspot-aarch64-fix-48bit-va.patch
* Fri Jun 03 2016
  - Added patch:
    * disable-doclint-by-default-patch
    - Disable Doclint while building javadoc by default. OpenJDK 8
      adds and enables doclint by default. This catches issues in
      javadoc comments. It is too strict, breaks javadoc compilation
      and, in general, breaks the build for old code known to build
      with previous versions of OpenJDK.
  - Cycle make on i586 in order to prevent some random build errors
    that are not easily reproduceable and thus fixable.
* Tue May 31 2016
  - Added patch:
    * java-1_8_0-openjdk-gcc6.patch
      + Fix build with gcc 6.1
  - Add -fno-delete-null-pointer-checks -fno-lifetime-dse to try to
    avoid some crashes
* Thu Apr 28 2016
  - Upgrade to version jdk8u91 (icedtea 3.0.1, bsc#976340)
  - Icedtea changes from 2.6.5
    * Security fixes
    - S8129952, CVE-2016-0686: Ensure thread consistency
    - S8132051, CVE-2016-0687: Better byte behavior
    - S8138593, CVE-2016-0695: Make DSA more fair
    - S8139008: Better state table management
    - S8143167, CVE-2016-3425: Better buffering of XML strings
    - S8143945, CVE-2016-3426: Better GCM validation
    - S8144430, CVE-2016-3427: Improve JMX connections
    - S8146494: Better ligature substitution
    - S8146498: Better device table adjustments
    * Import of OpenJDK 8 u91 build 14
    - S8002116: This gets an exit 1
    - S8007890: [TESTBUG] fails when
      invoked with NMT explicitly turned on
    - S8036132: Tab characters in test/com/sun/jdi files
    - S8038963: com/sun/jdi tests fail because cygwin's ps sometimes
      misses processes
    - S8044419: TEST_BUG: com/sun/jdi/ fails when
      run under root
    - S8059661: Test SoftReference and OOM behavior
    - S8067422: Lambda method names are unnecessarily unstable
    - S8073735: [TEST_BUG] compiler/loopopts/
      got OOME
    - S8074146: [TEST_BUG] jdb has succeded to read an unreadable
    - S8130212: Thread::current() might access freed memory on
    - S8132890: Text Overlapping on Dot Matrix Printers
    - S8134297: NPE in GSSNameElement nameType check
    - S8134650: Xsl transformation gives different results in 8u66
    - S8134828: Scrollbar thumb disappears with Nimbus L&F
    - S8138589: Correct limits on unlimited cryptography
    - S8138811: Construction of static protection domains
    - S8140268: Generate link to specification license for JavaDoc
      API documentation
    - S8141229: [Parfait] Null pointer dereference in cmsstrcasecmp
      of cmserr.c
    - S8143002: [Parfait] JNI exception pending in fontpath.c:1300
    - S8143959: Certificates requiring blacklisting
    - S8146477: [TEST_BUG] failing again
    - S8146518: Zero interpreter broken with better byte behaviour
    - S8146967: [TEST_BUG] javax/security/auth/SubjectDomainCombiner/
      should use 4-args ProtectionDomain constructor
    - S8147567: InterpreterRuntime::post_field_access not updated
      for boolean in JDK-8132051
    - S8148446: (tz) Support tzdata2016a
    - S8148475: Missing SA Bytecode updates.
    - S8148487: PPC64: Better byte behavior
    - S8148522: Backout JDK-8138811 from 2016 Apr CPU repo
    - S8149170: Better byte behavior for native arguments
    - S8149367: PolicyQualifierInfo/index_Ctor JCk test fails with
      IOE: Invalid encoding for PolicyQualifierInfo
    - S8150012: Better byte behavior for reflection
    - S8150790: 8u75 L10n resource file translation update
    * Backports
    - S8148752, PR2943: Compiled StringBuilder code throws
    - S8154210: Zero: Better byte behaviour
    - S8154413: AArch64: Better byte behaviour
    - S4890063, PR2304, RH1214835: HPROF: default text truncated
      when using doe=n option
    - S6425769, PR2859: Allow specifying an address to bind JMX
      remote connector
    - S8000650, PR2462: unpack200.exe should check gzip crc
    - S8031668, PR2842: TOOLCHAIN_FIND_COMPILER unexpectedly
      resolves symbolic links
    - S8035341: Allow using a system installed libpng
    - S8038392: Generating prelink cache breaks JAVA 'jinfo' utility
      normal behavior
    - S8042159: Allow using a system-installed lcms2
    - S8042806: Splashscreen uses libjpeg-internal macros
    - S8043805: Allow using a system-installed libjpeg
    - S8044235: should include all sources
    - S8074839, PR2462: Resolve disabled warnings for libunpack and
      the unpack200 binary
    - S8074859, PR1937: Turn on warnings as error
    - S8087218, PR2740: Constant fold loads from final instance
      fields in VM anonymous classes
    - S8139932, PR2739: Typo in makefile changes for 8043805 [Allow
      using a system-installed libjpeg]
    - S8140483, PR2740: Atomic*FieldUpdaters final fields should be
    - S8140620, PR2769: Find and load default.sf2 as the default
      soundbank on Linux
    - S8145096, PR2854: Undefined behaviour in HotSpot
    - S8145982, PR2859: JMXInterfaceBindingTest is failing
    - S8146015, PR2859: JMXInterfaceBindingTest is failing
      intermittently for IPv6 addresses
    - S8148351, PR2842: Only display resolved symlink for compiler,
      do not change path
    - S8150954, PR2866, RH1176206: AWT Robot not compatible with
      GNOME Shell
    * Bug fixes
    - PR2933: Support ccache 3.2 and later
    - PR2934: SunEC provider throwing KeyException with current NSS
    - S8041658: Use of -fdevirtualize on macroAssembler_x86.o
      (via -O2) with gcc 4.9.0 creates broken VM
    - PR94: empty install target in
    - PR729: GTKLookAndFeel should be the system look&feel on all
      GNU/Linux desktops
    - PR1275: Provide option to turn off downloading of tarballs
    - PR1281, RH513605: Updating/Installing OpenJDK should recreate
      the shared class-data archive
    - PR1289: Allow JARs to be optionally compressed by setting
    - PR1291: Ensure unlimited crypto policy is in place.
    - PR1325: Only add classes to rt-source-files.txt if actually
    - PR1341: Remove Rhino support
    - PR1346: Filter out -j option to make
    - PR1347: Update list of checked JDKs
    - PR1348: java -version output is broken
    - PR1357: Make XRender mandatory
    - PR1359: Check for /usr/lib64 JVMs and generic JPackage
    - PR1364: Replace hgforest support
    - PR1367: Support using the system installation of LCMS
    - PR1368: Ensure debug data is available for all libraries and
      binaries without redundant files
    - PR1369: Remove outdated bootstrap configure tests or make them
      fail on error
    - PR1377: Forwardport javac detection / usability test from
      IcedTea 2.x
    - PR1379: Add build support for Zero AArch64
    - PR1413: Undefined reference to libz during link of unpack200
    - PR1741: Break PulseAudio provider out into IcedTea-Sound
    - PR1766: Expand architecture support
    - PR1774: Support GIF lib v5
    - PR1774: Correct #ifdef to #if
    - PR1796: make fails with "computed checksum did NOT match"
    - PR1806: Support Debian/Ubuntu 7 & 8 OpenJDK Installs as Boot
    - PR1812: Unable to locate HotSpot checksum when downloading
    - PR1813: HotSpot URL should be used with --enable-hg
    - PR1815: Split download/extraction rules for OpenJDK so they
      can run in parallel
    - PR1829: Support AM_MAINTAINER_MODE
    - PR1834, RH1022017: Report elliptic curves supported by NSS,
      not the SunEC library
    - PR1845: jstack.stp in OpenJDK8 is broken
    - PR1869: Avoid x86 workaround when running Zero rather than a
    - PR1889: Allow tarball checksumming to be disabled
    - PR1935: HotSpot extraction needs to depend on the tarball
      being downloaded
    - PR1937: Add configure option for -Werror
    - PR1938: Zero broken by enforced use of -Werror
    - PR1942: Bug reports lack IcedTea version & distribution
      packaging information
    - PR1950: Add build support for Zero SH
    - PR1965, G498288: Allow builds on PaX kernels
    - PR1968: Move to new OpenJDK bug URL format
    - PR1975: SystemTap probes for the garbage collector.
    - PR1977: Support using the system installation of Zlib
    - PR1979: Support using the system installation of libjpeg
    - PR1980: Support using the system installation of giflib
    - PR1981: Support using the system installation of libpng
    - PR1983: Support using the system installation of NSS with the
      SunEC provider
    - PR1994: make dist broken
    - PR2001: Synchronise HEAD tarball paths with release branch
    - PR2066: Unset OS before running OpenJDK build
    - PR2095, RH1163501: 2048-bit DH upper bound too small for
      Fedora infrastructure
    - PR2126: Synchronise elliptic curves in with those listed by NSS
    - PR2127: SunEC provider crashes when built using system NSS
    - PR2199: Support giflib 5.1.0
    - PR2212: DGifCloseFile call should check the return value, not
      the error code, for failure
    - PR2227: giflib 5.1 conditional excludes 6.0, 7.0, etc.
    - PR2237, RH1194378: ppc64le should report its os.arch as
      ppc64le so tools can detect it
    - PR2248: HotSpot tarball fails verification after download
    - PR2256: Add SystemTap tests
    - PR2257: clean-extract-nashorn rule is never run
    - PR2321: Checksum of policy JAR files changes on every build
    - PR2329: jamvm parallel unpack failures
    - PR2339: Fail early if there is no native HotSpot JIT & all
      other options are disabled
    - PR2348: Avoid following symlinks for CACAO and JamVM patches
    - PR2351: Split CACAO rule into configure and make stages
    - PR2352: Split JamVM rule into configure, make and make install
    - PR2358: Add aliases for all stamp targets
    - PR2362: Update HACKING &
    - PR2363: Remove EC source code prior to build
    - PR2369: SunEC provider is partially installed
    - PR2377: PaX mark the installed JDK so it runs on hardened
    - PR2383: Location of docs directory in install-data-local is
    - PR2392: Make elliptic curve removal optional
    - PR2400, RH1206656: Zero JVM crashes on startup when built with
      GCC 5
    - PR2407: Fix automatic enabling of the Zero build on non-JIT
      architectures which don't use CACAO or JamVM
    - PR2408: Enable Zero when Shark is enabled
    - PR2409: Update Zero macro to match one in IcedTea 2.x
    - PR2410: Support PPC64 JIT on ppc64le
    - PR2411: Fix references to following PR2001
    - PR2413: OpenJDK doesn't auto-select Zero on architectures
      where no server JVM is available
    - PR2414: CFLAGS, CXXFLAGS and LDFLAGS should be passed to
      OpenJDK build
    - PR2415: JVM -Xmx requirement is too high on s390
    - PR2428: OpenJDK build can't handle commas in LDFLAGS
    - PR2429: OpenJDK build does not copy a symlinked cacerts file
    - PR2432: ppc64 JIT doesn't support class data sharing
    - PR2433: ppc64le does not support -Xshare:dump
    - PR2434: SystemTap support is no longer optional
    - PR2439: NSS PKCS11 regression - due to automatic
    - PR2443: install stage fails where
    - PR2447: Allow greater control of Javadoc installation
    - PR2448: Install TRADEMARK, COPYING and ChangeLog as RPM spec
      file does
    - PR2454: install-data-local needs to check that classes.jsa
      actually exists
    - PR2456: Installation path for hotspot_gc.stp is wrong, due to
      changed j2sdk-image location
    - PR2459: Policy JAR files should be timestamped with the date
      of the policy file they hold
    - PR2511: Reset success following calls in LayoutManager.cpp
    - PR2541: Allow the user to specify the cacerts file to use
    - PR2544: Desktop files do not allow installation from multiple
      versions of IcedTea
    - PR2547: Extend tarball checksumming option to allow the
      checksum to be specified
    - PR2631: jvm.cfg missing for ppc64le
    - PR2633: s390 builds still fail as BUILD_NUM_BITS is never set
    - PR2675: Update ppc64le autotools infrastructure following
    - PR2691, G564746: ./configure is unable to compile using distcc
      for icedtea-3.0.0_pre06
    - PR2737: Allow multiple PKCS11 library initialisation to be a
      non-critical error.
    - PR2738: java.lang.UnsatisfiedLinkError: no javalcms in
    - PR2743: Remove bad AArch64 merge fragment
    - PR2759: LCMS library should be named javalcms, not lcms, to
      avoid potential conflicts with the system library
    - PR2766: Remove all references to GCJ
    - PR2767: Remove remaining rogue binaries from OpenJDK tree
    - PR2768: Move SystemTap GCC 4.5 patch to OpenJDK tree or
      discard if no longer needed
    - PR2777: Fix MAX/MIN template usage on s390
    - PR2804: test/tapset/ should be executable
    - PR2815: Race condition in SunEC provider with system NSS
    - PR2825: Placement of -lfreebl matters when using bfd linker
    - PR2826: Provide option to disable SystemTap tests
    - PR2841: Parallelism issues resulting from PR2459
    - PR2863: IcedTea doesn't pass through build and host triplets
      to OpenJDK's configure
    - PR2865: Handle uninstallation.
    - PR2869: Revert CRC fix (S8000650) backported as part of PR2462
    - PR2873: Fix make distcheck.
    - PR2880: Add missing test directory in make check.
    - PR2885: Location of 'stap' executable is hard-coded
    - PR2888: OpenJDK should check for system cacerts database (e.g.
    - PR2899: Don't use WithSeed versions of NSS functions as they
      don't fully process the seed
    - PR2906: Support prefixed variants of GNU tools used on *BSD
    - PR2907: Replace --with-abs-install-dir with usual --prefix
    - PR2917: Don't pass --with-cacerts-file to build if
      USE_ALT_CACERTS_FILE is not set
    - PR2918: Makefile handles cacerts as a symlink, but the
      configure check doesn't
    - PR2920: PaX marking fails on filesystems which don't support
      extended attributes
    - PR2921: Uninstallation of docs deletes too much
    - Don't substitute 'j' for '-j' inside -I directives
    - Extend 8041658 to all files in the HotSpot build.
    - Remove jcheck
    * AArch64 port
    - PR1970: Imported from aarch64 jdk8 repository.
    - PR2853: Fix build for aarch64/zero
    - PR2853: Remaining miscellaneous synchronisation changes from
    - PR2853: Remove AArch64-specific code in generateOptoStub.cpp.
    - PR2853: Remove some AArch64-specific code in share/.
    - PR2853: Remove some unnecessary divergences from jdk8u.
    - PR2853: Revert AArch64 jvm.cfg divergence
    - PR2853: Revert changes to libpng source code now 8078245 is in
    - PR2922: Import latest AArch64 changes from aarch64-port/jdk8u
    - S8150652, PR2922: Remove unused code in AArch64 back end
    * JamVM
    - JSR 292: Invoke Dynamic
    - JSR 308: Type Annotations
    - JSR 335: Lambda Expressions
    - JSR 901: VM support for method parameter reflection
    - JEP 171: Implement fence methods in sun.misc.Unsafe
    - sun.misc.Unsafe: additional methods get/putAddress.
    - FreeClassData: adjust method count for Miranda methods
    - Fix invokesuper check in invokespecial opcode
    - Fix non-direct interpreter invokespecial super-class check
    - When GC'ing a native method don't try to free code
    - Do not free unprepared Miranda method code data
    - Set anonymous class protection domain
    - JVM_IsVMGeneratedMethodIx stub
    - Dummy implementation of sun.misc.Perf natives
    - JVM_NewMultiArray: element class may be an array
    - jtreg test java/lang/reflect/Array/ExceedMaxDim
    - OpenJDK: Fix Local/Anonymous class checks
    - classlibMarkThreadTerminated should return Object*
    - Fix race-condition in constant-pool resolution code
    - JSR 292: MethodHandle constant-pool refs may be resolved
    - JSR 292: bootstrap method args error handling
    - JSR 308: update to match OpenJDK changes
    - JSR 292: correct intrinsic cache COMPARE function
    - Race condition in setting up imethod table
    - GC: Minor performance improvement
    - PR2034: --enable-jamvm builds broken, missing
      JVM_GetTemporaryDirectory impl
    - PR2336: JamVM lacks JVM_FindClassFromCaller
    - PR2523: Add executable stack markings to callNative.S on JamVM
    - PR2775: JamVM lacks JVM_GetResourceLookupCacheURLs introduced
      by jdk8u40
    * CACAO
    - PR1277: Synchronise CACAO rules between IcedTea6/7/8 where
    - PR1279: Synchronise CACAO versions between IcedTea6/7/8 where
    - PR2035: --enable-cacao builds broken, missing
      JVM_GetTemporaryDirectory impl.
    - PR2330, CA172, G453612: Add ARM hardfloat support to CACAO on
    - PR2331: IcedTea8 fails to build with IcedTea7 CACAO due to low
      max heap size
    - PR2335: CACAO lacks JVM_FindClassFromCaller
    - PR2347: Fix CACAO patches to apply again
    - PR2349: 'struct jvm_version_info' has no member named
    - PR2350: Update to latest CACAO
    - PR2354: stamps/cacao.stamp tries to touch a file in a
      directory which doesn't exist
    - PR2355: CACAO build fails to use JRE layout
    - PR2776: CACAO lacks JVM_GetResourceLookupCacheURLs introduced
      by jdk8u40
    - PR2832, CA195: typeinfo.cpp: typeinfo_merge_nonarrays:
      Assertion `dest && result && x.any && y.any' failed
    - PR2908: Add missing functions for CACAO OpenJDK JVM
    - PR2909: Install CACAO in same way as JamVM
    - PR2910: Add rudimentary support for OpenJDK 8 class files to
    - PR2916: Update CACAO drop to use the latest from cacao-staging
  - Removed patches:
    * PStack-808293.patch
    * aarch64-misc.patch
    * disable-doclint-by-default.patch
    * include-all-srcs.patch
    * link-with-as-needed.patch
    * memory-limits.patch
    * multiple-pkcs11-library-init.patch
    * ppc64le-8036767.patch
    * s390-java-opts.patch
    * s390-size_t.patch
    * system-lcms.patch
    * system-libjpeg.patch
    * system-libpng.patch
    * zero-dummy.patch
    - Fixed upstream
  - Added patches:
    * icedtea-3.0.1-sunec.patch
    - Adapt the nss detection to SUSE packaging of mozilla-nss
    * java-1_8_0-openjdk-suse-desktop-files.patch
    - Adapt the desktop files for SUSE needs
  - Modified patches:
    * 1015432.patch
    * adlc-parser.patch
    * compare-pointer-with-literal.patch
    * implicit-pointer-decl.patch
    * java-atk-wrapper-security.patch
    * ppc-zero-hotspot.patch
    * zero-javadoc-verbose.patch
    - Adapt to new directory structure
* Wed Mar 30 2016
  - Update to upstream tag jdk8u77-b03 (bsc#972468)
    * CVE-2016-0636: Improve MethodHandle consistency
* Fri Feb 26 2016
  - Added patch:
    * ppc64le-8036767.patch
      + Change archinstall for ppc64le from ppc64 to ppc64le
* Mon Jan 25 2016
  - Upgrade to upstream tag jdk8u72-b15
    * Oracle Critical Patch Update of January 2016 (bsc#962743)
    * Using aarch64 hotspot tag aarch64-jdk8u72-b15
  - Security issues fixed:
    * CVE-2015-7575: Mozilla Network Security Services (NSS) before
      3.20.2, as used in Mozilla Firefox before 43.0.2 and Firefox
      ESR 38.x before 38.5.2, does not reject MD5 signatures in Server
      Key Exchange messages in TLS 1.2 Handshake Protocol traffic,
      which makes it easier for man-in-the-middle attackers to spoof
      servers by triggering a collision.
    * CVE-2015-8126: Multiple buffer overflows in the (1) png_set_PLTE
      and (2) png_get_PLTE functions in libpng before 1.0.64, 1.1.x
      and 1.2.x before 1.2.54, 1.3.x and 1.4.x before 1.4.17, 1.5.x
      before 1.5.24, and 1.6.x before 1.6.19 allow remote attackers to
      cause a denial of service (application crash) or possibly have
      unspecified other impact via a small bit-depth value in an IHDR
      (aka image header) chunk in a PNG image.
    * CVE-2016-0402: Unspecified vulnerability in the Java SE and
      Java SE Embedded components in Oracle Java SE 6u105, 7u91, and
      8u66 and Java SE Embedded 8u65 allows remote attackers to affect
      integrity via unknown vectors related to Networking.
    * CVE-2016-0448: Unspecified vulnerability in the Java SE and
      Java SE Embedded components in Oracle Java SE 6u105, 7u91, and
      8u66, and Java SE Embedded 8u65 allows remote authenticated
      users to affect confidentiality via vectors related to JMX.
    * CVE-2016-0466: Unspecified vulnerability in the Java SE, Java SE
      Embedded, and JRockit components in Oracle Java SE 6u105, 7u91,
      and 8u66; Java SE Embedded 8u65; and JRockit R28.3.8 allows
      remote attackers to affect availability via vectors related to
    * CVE-2016-0475: Unspecified vulnerability in the Java SE, Java SE
      Embedded, and JRockit components in Oracle Java SE 8u66; Java SE
      Embedded 8u65; and JRockit R28.3.8 allows remote attackers to
      affect confidentiality and integrity via unknown vectors related
      to Libraries.
    * CVE-2016-0483: Unspecified vulnerability in the Java SE, Java SE
      Embedded, and JRockit components in Oracle Java SE 6u105, 7u91,
      and 8u66; Java SE Embedded 8u65; and JRockit R28.3.8 allows
      remote attackers to affect confidentiality, integrity, and
      availability via vectors related to AWT.
    * CVE-2016-0494: Unspecified vulnerability in the Java SE and Java
      SE Embedded components in Oracle Java SE 6u105, 7u91, and 8u66
      and Java SE Embedded 8u65 allows remote attackers to affect
      confidentiality, integrity, and availability via unknown vectors
      related to 2D.
  - Modified patch:
    * s390-java-opts.patch
      + rediff to the changed context
* Thu Oct 22 2015
  - Upgrade to upstream tag jdk8u65-b17
    * Security fix release of October 21, 2015 (bsc#951376)
  - Security issues fixed:
    * CVE-2015-4734: A remote user can exploit a flaw in the Embedded
      JGSS component to partially access data
    * CVE-2015-4803: A remote user can exploit a flaw in the JRockit
      JAXP component to cause partial denial of service conditions
    * CVE-2015-4805: A remote user can exploit a flaw in the Embedded
      Serialization component to gain elevated privileges
    * CVE-2015-4806: A remote user can exploit a flaw in the Java SE
      Embedded Libraries component to partially access and partially
      modify data
    * CVE-2015-4835: A remote user can exploit a flaw in the Embedded
      CORBA component to gain elevated privileges
    * CVE-2015-4842: A remote user can exploit a flaw in the Embedded
      JAXP component to partially access data
    * CVE-2015-4843: A remote user can exploit a flaw in the Java SE
      Embedded Libraries component to gain elevated privileges
    * CVE-2015-4844: A remote user can exploit a flaw in the Embedded
      2D component to gain elevated privileges
    * CVE-2015-4860: A remote user can exploit a flaw in the Embedded
      RMI component to gain elevated privileges
    * CVE-2015-4872: A remote user can exploit a flaw in the JRockit
      Security component to partially modify data [].
    * CVE-2015-4881: A remote user can exploit a flaw in the Embedded
      CORBA component to gain elevated privileges
    * CVE-2015-4882: A remote user can exploit a flaw in the Embedded
      CORBA component to cause partial denial of service conditions
    * CVE-2015-4883: A remote user can exploit a flaw in the Embedded
      RMI component to gain elevated privileges
    * CVE-2015-4893: A remote user can exploit a flaw in the JRockit
      JAXP component to cause partial denial of service conditions
    * CVE-2015-4902: A remote user can exploit a flaw in the Java SE
      Deployment component to partially modify data
    * CVE-2015-4903: A remote user can exploit a flaw in the Embedded
      RMI component to partially access data
    * CVE-2015-4911: A remote user can exploit a flaw in the JRockit
      JAXP component to cause partial denial of service conditions
    * CVE-2015-4810: A local user can exploit a flaw in the Java SE
      Deployment component to gain elevated privileges
    * CVE-2015-4840: A remote user can exploit a flaw in the Embedded
      2D component to partially access data
    * CVE-2015-4868: A remote user can exploit a flaw in the Java SE
      Embedded Libraries component to gain elevated privileges
    * CVE-2015-4901: A remote user can exploit a flaw in the JavaFX
      component to gain elevated privileges
    * CVE-2015-4906: A remote user can exploit a flaw in the JavaFX
      component to partially access data
    * CVE-2015-4908: A remote user can exploit a flaw in the JavaFX
      component to partially access data
    * CVE-2015-4916: A remote user can exploit a flaw in the JavaFX
      component to partially access data
  - Modified patch:
    * s390-size_t.patch
    - Account for an additional uintptr_t <-> size_t mismatch
* Wed Aug 19 2015
  - Upgrade to upstream tag jdk8u60-b27
    * Release of JDK 8u60
  - Removed patches:
    * hotspot-support-kernel-4.patch
    * cplusplus-interpreter.patch
    * signed-overflow.patch
    - Integrated upstream
    * system-giflib5.patch
    - Fixed differently upstream
    * applet-hole.patch
    - Not needed any more with recent versions of icedtea-web
  - Modified patches
    * aarch64-misc.patch
    - Rediff to correspond to the new context
    - Added bits from aarch64-port/jdk8/jdk
* Tue Aug 18 2015
  - Add constraints file
* Wed Jul 22 2015
  - Upgrade to upstream tag jdk8u51-b16
    * Security fix release of July 15, 2015 (bsc#938248, bsc#937828)
  - Security issues fixed:
    * CVE-2015-2590: Vulnerability in the Java SE, Java SE Embedded
      component of Oracle Java SE (subcomponent: Libraries).
    * CVE-2015-2597: Vulnerability in the Java SE component of Oracle
      Java SE (subcomponent: Install).
    * CVE-2015-2601: Vulnerability in the Java SE, JRockit, Java SE
      Embedded component of Oracle Java SE (subcomponent: JCE).
    * CVE-2015-2613: Vulnerability in the Java SE, Java SE Embedded
      component of Oracle Java SE (subcomponent: JCE).
    * CVE-2015-2619: Vulnerability in the Java SE, JavaFX, Java SE
      Embedded component of Oracle Java SE (subcomponent: 2D).
    * CVE-2015-2621: Vulnerability in the Java SE, Java SE Embedded
      component of Oracle Java SE (subcomponent: JMX).
    * CVE-2015-2625: Vulnerability in the Java SE, JRockit, Java SE
      Embedded component of Oracle Java SE (subcomponent: JSSE).
    * CVE-2015-2627: Vulnerability in the Java SE component of Oracle
      Java SE (subcomponent: Install).
    * CVE-2015-2628: Vulnerability in the Java SE, Java SE Embedded
      component of Oracle Java SE (subcomponent: CORBA).
    * CVE-2015-2632; Vulnerability in the Java SE component of Oracle
      Java SE (subcomponent: 2D).
    * CVE-2015-2637: Vulnerability in the Java SE, JavaFX, Java SE
      Embedded component of Oracle Java SE (subcomponent: 2D).
    * CVE-2015-2638: Vulnerability in the Java SE, JavaFX, Java SE
      Embedded component of Oracle Java SE (subcomponent: 2D).
    * CVE-2015-2659: Vulnerability in the Java SE, Java SE Embedded
      component of Oracle Java SE (subcomponent: Security).
    * CVE-2015-2664: Vulnerability in the Java SE component of Oracle
      Java SE (subcomponent: Deployment).
    * CVE-2015-2808: Vulnerability in the Java SE, JRockit, Java SE
      Embedded component of Oracle Java SE (subcomponent: JSSE).
    * CVE-2015-4000: Vulnerability in the Java SE, JRockit, Java SE
      Embedded component of Oracle Java SE (subcomponent: JSSE).
    * CVE-2015-4729: Vulnerability in the Java SE component of Oracle
      Java SE (subcomponent: Deployment).
    * CVE-2015-4731: Vulnerability in the Java SE, Java SE Embedded
      component of Oracle Java SE (subcomponent: JMX).
    * CVE-2015-4732: Vulnerability in the Java SE, Java SE Embedded
      component of Oracle Java SE (subcomponent: Libraries).
    * CVE-2015-4733: Vulnerability in the Java SE, Java SE Embedded
      component of Oracle Java SE (subcomponent: RMI).
    * CVE-2015-4736: Vulnerability in the Java SE component of Oracle
      Java SE (subcomponent: Deployment).
    * CVE-2015-4748: Vulnerability in the Java SE, JRockit, Java SE
      Embedded component of Oracle Java SE (subcomponent: Security).
    * CVE-2015-4749: Vulnerability in the Java SE, JRockit, Java SE
      Embedded component of Oracle Java SE (subcomponent: JNDI).
    * CVE-2015-4760: Vulnerability in the Java SE component of Oracle
      Java SE (subcomponent: 2D).
* Thu Jun 18 2015
  - Use priority matching to ibm-java, always 5 bigger than it
* Wed Jun 10 2015
  - Added patch:
    * zero-dummy.patch
    - Fix crash of ZERO VM built with gcc5
* Fri Jun 05 2015
  - Added patch:
    * signed-overflow.patch
    - fix OOM due to signed overflow shown by gcc5 build
* Tue May 26 2015
  - Use the tzdb.dat from tzdata-java8 package on distributions
    that have it.
* Tue May 05 2015
  - Added patch:
    * hotspot-support-kernel-4.patch
    * fix build on systems having kernel 4.0
* Thu Apr 16 2015
  - Update the aarch64 tarball to the recent tip
    * The revision has merged changes up to jdk8u45-b14
  - Apply cplusplus-interpreter.patch to the default hotspot tarball
    only (aarch64 tarball has the patch integrated)
* Wed Apr 15 2015
  - Upgrade to upstream tag jdk8u45-b14
    * Security fix release of April 14, 2015
* Wed Apr 08 2015
  - Build the accelerated aarch64 hotspot anew
* Thu Mar 05 2015
  - Update the aarch64 tarball to a recent tip of the jdk8 repository
* Wed Mar 04 2015
  - jdk8u40-b25 became officially jdk8u40 release
    * Modify the package version
* Tue Feb 17 2015
  - Modified patch
    * system-libjpeg.patch
    - correct the case mismatch that prevented JPEG decoder from
      working correctly (bnc#905950)
* Mon Feb 16 2015
  - Upgrade to upstream tag jdk8u40-b25
* Thu Feb 05 2015
  - Upgrade to upstream tag jdk8u40-b24
  - Upgrade the aarch64 hotspot to new tip
    * sync-ed with jdk8u40-b23
  - Removed patch
    * aarch64-b12tob22.patch
    - Not needed since the aarch64 tarball is on a recent enough
  - Modified patch
    * s390-size_t.patch
    - Adapt to hotspot changes
* Tue Jan 27 2015
  - Removed patch
    * aarch64-b12tob21.patch
    - replaced by one that forward-ports to b22
  - Added patch
    * aarch64-b12tob22.patch
    - forward-port the aarch64 hotspot to b22.
* Sun Jan 25 2015
  - Modify patch: system-giflib5.patch
    * Fix build with giflib 5.1.x
* Thu Jan 22 2015
  - Upgrade to upstream tag jdk8u40-b22
    * Security update from 2015-01-20
* Wed Jan 21 2015
  - Upgrade to upstream tag jdk8u40-b21
  - Removed patch:
    * aarch64-b12tob20.patch
    - replaced by new version
  - Added patch:
    * aarch64-b12tob21.patch
    - port the relevant changes between builds b12 and b21 to the
      aarch64 tarball that is on the upstream tag of jdk8u40-b12
* Mon Jan 12 2015
  - Upgrade to upstream tag jdk8u40-b20
    * Switch to the jdk8u40 stabilisation branch that will result in
      the jdk8u40 release
  - Removed patch:
    * hotspot-build-j-directive.patch
    - integrated in the jdk8u40-b20 version of hotspot
  - Added patches:
    * aarch64-b12tob20.patch
    - port the relevant changes between builds b12 and b20 to the
      aarch64 tarball that is on the upstream tag of jdk8u40-b12
    * cplusplus-interpreter.patch
    - fix a build of C++ interpreter that is used with Zero virtual
* Sun Jan 04 2015
  - zero-javadoc-verbose.patch: Avoid triggering inactivity timeout while
    generating javadoc in zero VM
* Mon Dec 08 2014
  - Require version of tzdata-java compatible with this version
    of Java.
* Sun Nov 23 2014
  - Define bits to %__isa_bits if defined
* Tue Nov 11 2014
  - Modified patches:
    * s390-size_t.patch
    - rediff and drop unnecessary chunks
    * s390-java-opts.patch
    - modify to correspond to the changed context
* Mon Nov 10 2014
  - Put manpage alternative for policy-tool to the right package
* Tue Nov 04 2014
  - Upgrade to upstream tag jdk8u40-b12
    * Unstable snapshot in view of jdk8u40 release
    * aarch64 hotspot merged to the level of jdk8u40-b12
  - Remove unneeded aarch64-jdk8u40-b09_b10.patch:
    * the aarch64 hotspot merge contains all the changes
* Wed Oct 29 2014
  - Update config.sub and config.guess to the recent master of
* Fri Oct 17 2014
  - Upgrade to upstream tag jdk8u40-b10
    * Unstable snapshot in view of jdk8u40 release
    * Contains security fixes from 14 october 2014
  - Add aarch64-jdk8u40-b09_b10.patch
    * Manually upgrade the aarch64 hotspot tarball with the changes
      between b09 and b10
* Thu Oct 16 2014
  - Allow building for SLE11
    * Conditionalize BuildRequires
    * Conditionalize cxxflags not understood by gcc 4.3
    * Conditionalize javadoc noarch build for distributions that
      understand the per-package BuildArch
  - Try to make the jre-32 and jre-64 provides more automatic
  - Disable brp-check-bytecode-version during install
    * java8 will have bytecode version 8 in its jars
* Tue Oct 07 2014
  - Force Zero VM for aarch64, since from the beginning we did not
    manage to finish a build of Hotspot for this architecture.
* Thu Oct 02 2014
  - Upgrade to upstream tag jdk8u40-b08
    * Unstable snapshot in view of jdk8u40 release
* Mon Sep 29 2014
  - Build template jvm interpreter on ppc64le
    * It was ported for this architecture in jdk8u49-b06
  - Build depend on the generic java-bootstrap-devel
    * Allows to build against java-1_7_0-openjdk-bootstrap
  - Reformat the spec file with spec-cleaner
* Fri Sep 26 2014
  - Upgrade to upstream tag jdk8u40-b07
    * Unstable snapshot in view of jdk8u40 release
  - Removed patch: aarch64-jni-update.patch
    * Upstreamed changes
  - Modified patch: aarch64-misc.patch
    * Do not patch that is anyway regenerated.
  - Modified patch: system-libjpeg.patch
    * Do not patch that is anyway regenerated.
    * Rediff to apply cleanly
  - Modified patches: link-with-as-needed.patch,
    system-giflib5.patch, system-lcms.patch, system-libpng.patch
    * Rediff to apply cleanly
* Tue Sep 23 2014
  - Add provides jre-32 on %{ix86} and ppc
    * This satisfies libreoffice's requires
* Mon Sep 08 2014
  - Add provides jre-64 on x86_64. bnc#895191
* Wed Aug 20 2014
  - Upgrade to upstream tag jdk8u20-b26
    * Tag corresponding to jdk8u20 public release
  - Do not include the build number in version information, since
    this is the official release
* Wed Jul 23 2014
  - Use icedtea-sound-1.0.1 release tarball
* Fri Jul 18 2014
  - Upgrade to upstream tag jdk8u20-b23
    * Security updates from 15 July 2014
  - Removed patch: voidreturn.patch
    * Integrated upstream
  - Re-diffed patch: java-atk-wrapper-security.patch
    * Re-diff to correspond to the new changes
  - Modify accessibility post script to actually create the
    corresponding symlinks
* Tue Jul 15 2014
  - Initial package built from upstream OpenJDK
    * Version
    * Sources from
      tag jdk8u20-b22
  - Initial bug-/build-fix patches
    * 1015432.patch
    * aarch64-jni-update.patch
    * aarch64-misc.patch
    * adlc-parser.patch
    * applet-hole.patch
    * compare-pointer-with-literal.patch
    * disable-doclint-by-default.patch
    * hotspot-build-j-directive.patch
    * implicit-pointer-decl.patch
    * include-all-srcs.patch
    * java-atk-wrapper-security.patch
    * link-with-as-needed.patch
    * memory-limits.patch
    * multiple-pkcs11-library-init.patch
    * ppc-zero-hotspot.patch
    * PStack-808293.patch
    * s390-java-opts.patch
    * s390-size_t.patch
    * system-giflib5.patch
    * system-lcms.patch
    * system-libjpeg.patch
    * system-libpng.patch
    * voidreturn.patch
  - Added aarch64 hotspot from the tip of
  - Added pulseaudio provider from the tip of



Generated by rpm2html 1.8.1

Fabrice Bellet, Sat Mar 10 21:25:16 2018